{"text_format":"1","workbook":"xlsx","n_sheets":2,"sheets":["Sheet1","商品データ"],"not_rendered":{"charts":0,"images":0,"macros":1,"external_links":0,"defined_names":0,"comments":0,"pivot_tables":0},"unopened":[],"bounds":{"document_bytes":16777216,"sheet_cells":100000,"rows_first":2000,"rows_last":500,"rows_between":2000,"halvings":0,"cell_chars":16384,"cell_head_chars":4096},"cells_cut":0,"cells_raw":0,"read":"whole","date_system":"1900"}

{"sheet":"Sheet1","index":0,"n_rows":11,"n_cols":5,"rows_kept":11,"cut":false,"hidden":false,"merged":[]}
["No.","商品コード","商品名","サイズ",false]
[1,null,{"$f":"IF($B2=\"\",\"\",IFERROR(INDEX(商品データ!$B:$B,MATCH(Sheet1!$B2,商品データ!$A:$A,0)),\"\"))","v":""},{"$f":"IF($B2=\"\",\"\",IFERROR(INDEX(商品データ!$C:$C,MATCH(Sheet1!$B2,商品データ!$A:$A,0)),\"\"))","v":""}]
[2,null,{"$f":"IF($B3=\"\",\"\",IFERROR(INDEX(商品データ!$B:$B,MATCH(Sheet1!$B3,商品データ!$A:$A,0)),\"\"))","v":""},{"$f":"IF($B3=\"\",\"\",IFERROR(INDEX(商品データ!$C:$C,MATCH(Sheet1!$B3,商品データ!$A:$A,0)),\"\"))","v":""}]
[3,null,{"$f":"IF($B4=\"\",\"\",IFERROR(INDEX(商品データ!$B:$B,MATCH(Sheet1!$B4,商品データ!$A:$A,0)),\"\"))","v":""},{"$f":"IF($B4=\"\",\"\",IFERROR(INDEX(商品データ!$C:$C,MATCH(Sheet1!$B4,商品データ!$A:$A,0)),\"\"))","v":""}]
[4,null,{"$f":"IF($B5=\"\",\"\",IFERROR(INDEX(商品データ!$B:$B,MATCH(Sheet1!$B5,商品データ!$A:$A,0)),\"\"))","v":""},{"$f":"IF($B5=\"\",\"\",IFERROR(INDEX(商品データ!$C:$C,MATCH(Sheet1!$B5,商品データ!$A:$A,0)),\"\"))","v":""}]
[5,null,{"$f":"IF($B6=\"\",\"\",IFERROR(INDEX(商品データ!$B:$B,MATCH(Sheet1!$B6,商品データ!$A:$A,0)),\"\"))","v":""},{"$f":"IF($B6=\"\",\"\",IFERROR(INDEX(商品データ!$C:$C,MATCH(Sheet1!$B6,商品データ!$A:$A,0)),\"\"))","v":""}]
[6,null,{"$f":"IF($B7=\"\",\"\",IFERROR(INDEX(商品データ!$B:$B,MATCH(Sheet1!$B7,商品データ!$A:$A,0)),\"\"))","v":""},{"$f":"IF($B7=\"\",\"\",IFERROR(INDEX(商品データ!$C:$C,MATCH(Sheet1!$B7,商品データ!$A:$A,0)),\"\"))","v":""}]
[7,null,{"$f":"IF($B8=\"\",\"\",IFERROR(INDEX(商品データ!$B:$B,MATCH(Sheet1!$B8,商品データ!$A:$A,0)),\"\"))","v":""},{"$f":"IF($B8=\"\",\"\",IFERROR(INDEX(商品データ!$C:$C,MATCH(Sheet1!$B8,商品データ!$A:$A,0)),\"\"))","v":""}]
[8,null,{"$f":"IF($B9=\"\",\"\",IFERROR(INDEX(商品データ!$B:$B,MATCH(Sheet1!$B9,商品データ!$A:$A,0)),\"\"))","v":""},{"$f":"IF($B9=\"\",\"\",IFERROR(INDEX(商品データ!$C:$C,MATCH(Sheet1!$B9,商品データ!$A:$A,0)),\"\"))","v":""}]
[9,null,{"$f":"IF($B10=\"\",\"\",IFERROR(INDEX(商品データ!$B:$B,MATCH(Sheet1!$B10,商品データ!$A:$A,0)),\"\"))","v":""},{"$f":"IF($B10=\"\",\"\",IFERROR(INDEX(商品データ!$C:$C,MATCH(Sheet1!$B10,商品データ!$A:$A,0)),\"\"))","v":""}]
[10,null,{"$f":"IF($B11=\"\",\"\",IFERROR(INDEX(商品データ!$B:$B,MATCH(Sheet1!$B11,商品データ!$A:$A,0)),\"\"))","v":""},{"$f":"IF($B11=\"\",\"\",IFERROR(INDEX(商品データ!$C:$C,MATCH(Sheet1!$B11,商品データ!$A:$A,0)),\"\"))","v":""}]

{"sheet":"商品データ","index":1,"n_rows":26,"n_cols":3,"rows_kept":26,"cut":false,"hidden":false,"merged":[]}
["商品コード","商品名","サイズ"]
[10101,"#○○○　カラー：ホワイト　サイズ：XS","XS"]
[10102,"#○○○　カラー：ホワイト　サイズ：S","S"]
[10103,"#○○○　カラー：ホワイト　サイズ：M","M"]
[10104,"#○○○　カラー：ホワイト　サイズ：L","L"]
[10105,"#○○○　カラー：ホワイト　サイズ：XL","XL"]
[10201,"#○○○　カラー：ブラック　サイズ：XS","XS"]
[10202,"#○○○　カラー：ブラック　サイズ：S","S"]
[10203,"#○○○　カラー：ブラック　サイズ：M","M"]
[10204,"#○○○　カラー：ブラック　サイズ：L","L"]
[10205,"#○○○　カラー：ブラック　サイズ：XL","XL"]
[20101,"#○○○　カラー：マゼンタ　サイズ：XS","XS"]
[20102,"#○○○　カラー：マゼンタ　サイズ：S","S"]
[20103,"#○○○　カラー：マゼンタ　サイズ：M","M"]
[20104,"#○○○　カラー：マゼンタ　サイズ：L","L"]
[20105,"#○○○　カラー：マゼンタ　サイズ：XL","XL"]
[20201,"#○○○　カラー：シアン　サイズ：XS","XS"]
[20202,"#○○○　カラー：シアン　サイズ：S","S"]
[20203,"#○○○　カラー：シアン　サイズ：M","M"]
[20204,"#○○○　カラー：シアン　サイズ：L","L"]
[20205,"#○○○　カラー：シアン　サイズ：XL","XL"]
[20301,"#○○○　カラー：イエロー　サイズ：XS","XS"]
[20302,"#○○○　カラー：イエロー　サイズ：S","S"]
[20303,"#○○○　カラー：イエロー　サイズ：M","M"]
[20304,"#○○○　カラー：イエロー　サイズ：L","L"]
[20305,"#○○○　カラー：イエロー　サイズ：XL","XL"]